Reaction Details
Target5-hydroxytryptamine receptor 1A
LigandBDBM50001859
Substrate/Competitorn/a
Meas. Tech.ChEMBL_858 (CHEMBL615914)
IC50 12.8±n/a nM
Citation Perrone, RBerardi, FColabufo, NALeopoldo, MTortorella, VFiorentini, FOlgiati, VGhiglieri, AGovoni, S High affinity and selectivity on 5-HT1A receptor of 1-aryl-4-[1-tetralin)alkyl]piperazines. 2. J Med Chem38:942-9 (1995) 5-hydroxytryptamine receptor 1A
Name:5-hydroxytryptamine receptor 1A
Type:G Protein-Coupled Receptor (GPCR)
Mol. Mass.:46445.29
Organism:Rattus norvegicus (rat)
Description:Binding assays were performed using rat hippocampal membranes.
Residue:422
BDBM50001859
NameBDBM50001859
Synonyms:(buspirone) 8-[4-(4-Pyrimidin-2-yl-piperazin-1-yl)-butyl]-8-aza-spiro[4.5]decane-7,9-dione 8-[4-(4-Pyrimidin-2-yl-piperazin-1-yl)-butyl]-8-aza-spiro[4.5]decane-7,9-dione; Hydrochloride(Buspirone) BUSPAR CHEMBL49 | US10562853, Compound Buspirone
TypeSmall organic molecule
Emp. Form.C21H31N5O2
Mol. Mass.385.5031
SMILESO=C1CC2(CCCC2)CC(=O)N1CCCCN1CCN(CC1)c1ncccn1