Reaction Details
TargetUrease
LigandBDBM50488923
Substrate/Competitorn/a
Meas. Tech.ChEMBL_931029 (CHEMBL3070477)
Ki 1230±n/a nM
Citation  TBA Med Chem Res22:3653-3662 (2013)    Article
 
Urease
Name:Urease
Type:Enzyme
Mol. Mass.:90746.20
Organism:Canavalia ensiformis (Jack bean) (Horse bean)
Description:P07374
Residue:840
BDBM50488923
NameBDBM50488923
Synonyms:CHEMBL2298031
TypeSmall organic molecule
Emp. Form.C18H21N3O3S2
Mol. Mass.391.508
SMILESCCC(CC(=O)NC(=S)Nc1ccc(cc1)S(N)(=O)=O)c1ccccc1