Reaction Details
TargetEndothelin receptor type B
LigandBDBM50034263
Substrate/Competitorn/a
Meas. Tech.ChEMBL_63705 (CHEMBL676631)
IC50 417±n/a nM
Citation Doherty, AMPatt, WCEdmunds, JJBerryman, KAReisdorph, BRPlummer, MSShahripour, ALee, CCheng, XMWalker, DM Discovery of a novel series of orally active non-peptide endothelin-A (ETA) receptor-selective antagonists. J Med Chem38:1259-63 (1995) Endothelin receptor type B
Name:Endothelin receptor type B
Type:Enzyme Catalytic Domain
Mol. Mass.:49664.00
Organism:Homo sapiens (Human)
Description:ENDOTHELIN B EDNRB HUMAN::P24530
Residue:442
BDBM50034263
NameBDBM50034263
Synonyms:CHEMBL25438 Sodium; (Z)-2-benzo[1,3]dioxol-5-yl-4-(4-methoxy-phenyl)-4-oxo-3-(3,4,5-trimethoxy-benzyl)-but-2-enoate
TypeSmall organic molecule
Emp. Form.C28H25O9
Mol. Mass.505.4932
SMILESCOc1ccc(cc1)C(=O)C(\Cc1cc(OC)c(OC)c(OC)c1)=C(/C([O-])=O)c1ccc2OCOc2c1