Reaction Details
Target5-hydroxytryptamine receptor 1A
LigandBDBM50034311
Substrate/Competitorn/a
Meas. Tech.ChEMBL_589 (CHEMBL615459)
Ki 1000±n/a nM
Citation Jain, ANHarris, NLPark, JY Quantitative binding site model generation: compass applied to multiple chemotypes targeting the 5-HT1A receptor. J Med Chem38:1295-308 (1995) 5-hydroxytryptamine receptor 1A
Name:5-hydroxytryptamine receptor 1A
Type:n/a
Mol. Mass.:46122.49
Organism:Homo sapiens (Human)
Description:n/a
Residue:422
BDBM50034311
NameBDBM50034311
Synonyms:(3aR,9aR)-5-Methoxy-1-propyl-2,3,3a,4,9,9a-hexahydro-1H-benzo[f]indole (Recemic)5-Methoxy-1-propyl-2,3,3a,4,9,9a-hexahydro-1H-benzo[f]indole | CHEMBL282492
TypeSmall organic molecule
Emp. Form.C16H23NO
Mol. Mass.245.3599
SMILESCCCN1CC[C@H]2Cc3c(C[C@@H]12)cccc3OC