Reaction Details
Target5-hydroxytryptamine receptor 1A
LigandBDBM50034314
Substrate/Competitorn/a
Meas. Tech.ChEMBL_589 (CHEMBL615459)
Ki 1000±n/a nM
Citation Jain, ANHarris, NLPark, JY Quantitative binding site model generation: compass applied to multiple chemotypes targeting the 5-HT1A receptor. J Med Chem38:1295-308 (1995) 5-hydroxytryptamine receptor 1A
Name:5-hydroxytryptamine receptor 1A
Type:n/a
Mol. Mass.:46122.49
Organism:Homo sapiens (Human)
Description:n/a
Residue:422
BDBM50034314
NameBDBM50034314
Synonyms:(3aS,9aS)-5-Methoxy-2,3,3a,4,9,9a-hexahydro-1H-benzo[f]indole CHEMBL12108
TypeSmall organic molecule
Emp. Form.C13H17NO
Mol. Mass.203.2802
SMILESCOc1cccc2C[C@@H]3NCC[C@@H]3Cc12