Reaction Details
Target5-hydroxytryptamine receptor 1A
LigandBDBM50034334
Substrate/Competitorn/a
Meas. Tech.ChEMBL_589 (CHEMBL615459)
Ki 470±n/a nM
Citation Jain, ANHarris, NLPark, JY Quantitative binding site model generation: compass applied to multiple chemotypes targeting the 5-HT1A receptor. J Med Chem38:1295-308 (1995) 5-hydroxytryptamine receptor 1A
Name:5-hydroxytryptamine receptor 1A
Type:n/a
Mol. Mass.:46122.49
Organism:Homo sapiens (Human)
Description:n/a
Residue:422
BDBM50034334
NameBDBM50034334
Synonyms:(3aR,9aR)-1-Allyl-2,3,3a,4,9,9a-hexahydro-1H-benzo[f]indol-5-ol CHEMBL24050
TypeSmall organic molecule
Emp. Form.C15H19NO
Mol. Mass.229.3175
SMILESOc1cccc2C[C@@H]3[C@@H](CCN3CC=C)Cc12