Reaction Details
Target5-hydroxytryptamine receptor 1A
LigandBDBM50034363
Substrate/Competitorn/a
Meas. Tech.ChEMBL_589 (CHEMBL615459)
Ki 1000±n/a nM
Citation Jain, ANHarris, NLPark, JY Quantitative binding site model generation: compass applied to multiple chemotypes targeting the 5-HT1A receptor. J Med Chem38:1295-308 (1995) 5-hydroxytryptamine receptor 1A
Name:5-hydroxytryptamine receptor 1A
Type:n/a
Mol. Mass.:46122.49
Organism:Homo sapiens (Human)
Description:n/a
Residue:422
BDBM50034363
NameBDBM50034363
Synonyms:(3aR,9bS)-3-Propyl-2,3,3a,4,5,9b-hexahydro-1H-benzo[e]indol-6-ol | CHEMBL26560
TypeSmall organic molecule
Emp. Form.C15H21NO
Mol. Mass.231.3333
SMILESCCCN1CC[C@@H]2[C@H]1CCc1c(O)cccc21