Reaction Details
TargetEndothelin-1 receptor
LigandBDBM50034411
Substrate/Competitorn/a
Meas. Tech.ChEMBL_63217 (CHEMBL674069)
IC50 80±n/a nM
Citation Stein, PDFloyd, DMBisaha, SDickey, JGirotra, RNGougoutas, JZKozlowski, MLee, VGLiu, ECMalley, MF Discovery and structure-activity relationships of sulfonamide ETA-selective antagonists. J Med Chem38:1344-54 (1995) Endothelin-1 receptor
Name:Endothelin-1 receptor
Type:Enzyme Catalytic Domain
Mol. Mass.:48256.91
Organism:RAT
Description:ENDOTHELIN A EDNRA RAT::P26684
Residue:426
BDBM50034411
NameBDBM50034411
Synonyms:5-Pentylamino-naphthalene-1-sulfonic acid (3,4-dimethyl-isoxazol-5-yl)-amide | CHEMBL27299
TypeSmall organic molecule
Emp. Form.C20H25N3O3S
Mol. Mass.387.496
SMILESCCCCCNc1cccc2c(cccc12)S(=O)(=O)Nc1onc(C)c1C