Reaction Details
TargetEndothelin-1 receptor
LigandBDBM50034475
Substrate/Competitorn/a
Meas. Tech.ChEMBL_63217 (CHEMBL674069)
IC50 150±n/a nM
Citation Stein, PDFloyd, DMBisaha, SDickey, JGirotra, RNGougoutas, JZKozlowski, MLee, VGLiu, ECMalley, MF Discovery and structure-activity relationships of sulfonamide ETA-selective antagonists. J Med Chem38:1344-54 (1995) Endothelin-1 receptor
Name:Endothelin-1 receptor
Type:Enzyme Catalytic Domain
Mol. Mass.:48256.91
Organism:RAT
Description:ENDOTHELIN A EDNRA RAT::P26684
Residue:426
BDBM50034475
NameBDBM50034475
Synonyms:5-(3-Phenyl-thioureido)-naphthalene-1-sulfonic acid (3,4-dimethyl-isoxazol-5-yl)-amide | CHEMBL27063
TypeSmall organic molecule
Emp. Form.C22H20N4O3S2
Mol. Mass.452.549
SMILESCc1noc(NS(=O)(=O)c2cccc3c(NC(=S)Nc4ccccc4)cccc23)c1C