Reaction Details
TargetSeed linoleate 13S-lipoxygenase-1
LigandBDBM50489110
Substrate/Competitorn/a
Meas. Tech.ChEMBL_930119 (CHEMBL3068968)
Ki 1163±n/a nM
Citation  TBA Med Chem Res22:5036-5043 (2013)    Article
 
Seed linoleate 13S-lipoxygenase-1
Name:Seed linoleate 13S-lipoxygenase-1
Type:Enzyme
Mol. Mass.:94365.66
Organism:Glycine max (soybean)
Description:n/a
Residue:839
BDBM50489110
NameBDBM50489110
Synonyms:CHEMBL2296823
TypeSmall organic molecule
Emp. Form.C23H25N5S
Mol. Mass.403.543
SMILESCCCc1nc(nc2Sc3ccccc3Nc12)N1CCN(CC1)c1ccccc1