Reaction Details
TargetSeed linoleate 13S-lipoxygenase-1
LigandBDBM50489109
Substrate/Competitorn/a
Meas. Tech.ChEMBL_930119 (CHEMBL3068968)
Ki 662±n/a nM
Citation  TBA Med Chem Res22:5036-5043 (2013)    Article
 
Seed linoleate 13S-lipoxygenase-1
Name:Seed linoleate 13S-lipoxygenase-1
Type:Enzyme
Mol. Mass.:94365.66
Organism:Glycine max (soybean)
Description:n/a
Residue:839
BDBM50489109
NameBDBM50489109
Synonyms:CHEMBL2296820
TypeSmall organic molecule
Emp. Form.C18H22N4S
Mol. Mass.326.459
SMILESCCCc1nc(nc2Sc3ccccc3Nc12)N1CCCCC1