Reaction Details
TargetSeed linoleate 13S-lipoxygenase-1
LigandBDBM50282770
Substrate/Competitorn/a
Meas. Tech.ChEMBL_930119 (CHEMBL3068968)
Ki 192±n/a nM
Citation  TBA Med Chem Res22:5036-5043 (2013)    Article
 
Seed linoleate 13S-lipoxygenase-1
Name:Seed linoleate 13S-lipoxygenase-1
Type:Enzyme
Mol. Mass.:94365.66
Organism:Glycine max (soybean)
Description:n/a
Residue:839
BDBM50282770
NameBDBM50282770
Synonyms:CHEMBL2296824
TypeSmall organic molecule
Emp. Form.C18H23N5S
Mol. Mass.341.474
SMILESCCCc1nc(nc2Sc3ccccc3Nc12)N1CCN(C)CC1