Reaction Details
TargetSeed linoleate 13S-lipoxygenase-1
LigandBDBM192766
Substrate/Competitorn/a
Meas. Tech.ChEMBL_930119 (CHEMBL3068968)
Ki 198±n/a nM
Citation  TBA Med Chem Res22:5036-5043 (2013)    Article
 
Seed linoleate 13S-lipoxygenase-1
Name:Seed linoleate 13S-lipoxygenase-1
Type:Enzyme
Mol. Mass.:94365.66
Organism:Glycine max (soybean)
Description:n/a
Residue:839
BDBM192766
NameBDBM192766
Synonyms:4-MMPB
TypeSmall organic molecule
Emp. Form.C16H19N5S
Mol. Mass.313.421
SMILESCN1CCN(CC1)c1nc(C)c2Nc3ccccc3Sc2n1