Reaction Details
TargetSeed linoleate 13S-lipoxygenase-1
LigandBDBM50489108
Substrate/Competitorn/a
Meas. Tech.ChEMBL_930119 (CHEMBL3068968)
Ki 486±n/a nM
Citation  TBA Med Chem Res22:5036-5043 (2013)    Article
 
Seed linoleate 13S-lipoxygenase-1
Name:Seed linoleate 13S-lipoxygenase-1
Type:Enzyme
Mol. Mass.:94365.66
Organism:Glycine max (soybean)
Description:n/a
Residue:839
BDBM50489108
NameBDBM50489108
Synonyms:CHEMBL2296821
TypeSmall organic molecule
Emp. Form.C19H24N4S
Mol. Mass.340.486
SMILESCCCc1nc(nc2Sc3ccccc3Nc12)N1CCC(C)CC1