Reaction Details
TargetPhosphodiesterase
LigandBDBM50109609
Substrate/Competitorn/a
Meas. Tech.ChEMBL_930438 (CHEMBL3074004)
IC50 748000±n/a nM
Citation  TBA Med Chem Res22:5248-5254 (2013)    Article
 
Phosphodiesterase
Name:Phosphodiesterase
Type:PROTEIN
Mol. Mass.:64586.65
Organism:Crotalus adamanteus
Description:ChEMBL_106586
Residue:563
BDBM50109609
NameBDBM50109609
Synonyms:(2R)-2-amino-3-mercaptopropanoic acid (R)-2-amino-3-mercaptopropanoic acid CYSTEINE L-Cystein L-cysteine | US11021454, Compound L-cys
TypeSmall organic molecule
Emp. Form.C3H7NO2S
Mol. Mass.121.158
SMILESN[C@@H](CS)C(O)=O