Reaction Details
TargetUrokinase-type plasminogen activator
LigandBDBM50034585
Substrate/Competitorn/a
Meas. Tech.ChEMBL_213133 (CHEMBL817633)
Ki>4.3±n/a nM
Citation Deadman, JJElgendy, SGoodwin, CAGreen, DBaban, JAPatel, GSkordalakes, EChino, NClaeson, GKakkar, VV Characterization of a class of peptide boronates with neutral P1 side chains as highly selective inhibitors of thrombin. J Med Chem38:1511-22 (1995) Urokinase-type plasminogen activator
Name:Urokinase-type plasminogen activator
Type:Enzyme
Mol. Mass.:48528.62
Organism:Homo sapiens (Human)
Description:P00749
Residue:431
BDBM50034585
NameBDBM50034585
Synonyms:CHEMBL285285 | Peptide boronate
TypeSmall organic molecule
Emp. Form.C40H48BN3O6
Mol. Mass.677.637
SMILESCC1(C)C2CC1[C@]1(C)OB(O[C@@H]1C2)C(Cc1ccccc1)NC(=O)[C@@H]1CCCN1C(=O)[C@H](Cc1ccccc1)NC(=O)OCc1ccccc1