Reaction Details
TargetUrokinase-type plasminogen activator
LigandBDBM50034581
Substrate/Competitorn/a
Meas. Tech.ChEMBL_213133 (CHEMBL817633)
Ki 33±n/a nM
Citation Deadman, JJElgendy, SGoodwin, CAGreen, DBaban, JAPatel, GSkordalakes, EChino, NClaeson, GKakkar, VV Characterization of a class of peptide boronates with neutral P1 side chains as highly selective inhibitors of thrombin. J Med Chem38:1511-22 (1995) Urokinase-type plasminogen activator
Name:Urokinase-type plasminogen activator
Type:Enzyme
Mol. Mass.:48528.62
Organism:Homo sapiens (Human)
Description:P00749
Residue:431
BDBM50034581
NameBDBM50034581
Synonyms:CHEMBL36744 | Peptide boronate
TypeSmall organic molecule
Emp. Form.C43H54BN3O7
Mol. Mass.735.716
SMILESCOCCCC(NC(=O)[C@@H]1CCCN1C(=O)[C@@H](NC(=O)OCc1ccccc1)C(c1ccccc1)c1ccccc1)B1O[C@@H]2CC3CC(C3(C)C)[C@]2(C)O1