Reaction Details
TargetCoagulation factor X
LigandBDBM50034579
Substrate/Competitorn/a
Meas. Tech.ChEMBL_48663 (CHEMBL657715)
Ki 2.6±n/a nM
Citation Deadman, JJElgendy, SGoodwin, CAGreen, DBaban, JAPatel, GSkordalakes, EChino, NClaeson, GKakkar, VV Characterization of a class of peptide boronates with neutral P1 side chains as highly selective inhibitors of thrombin. J Med Chem38:1511-22 (1995) Coagulation factor X
Name:Coagulation factor X
Type:Enzyme
Mol. Mass.:54726.60
Organism:Homo sapiens (Human)
Description:n/a
Residue:488
BDBM50034579
NameBDBM50034579
Synonyms:CHEMBL290577 | Peptide boronate
TypeSmall organic molecule
Emp. Form.C38H52BN3O6
Mol. Mass.657.647
SMILESCCC(C)(C)C(NC(=O)[C@@H]1CCCN1C(=O)[C@H](Cc1ccccc1)NC(=O)OCc1ccccc1)B1O[C@@H]2CC3CC(C3(C)C)[C@]2(C)O1