Reaction Details
TargetProthrombin
LigandBDBM50034580
Substrate/Competitorn/a
Meas. Tech.ChEMBL_208171 (CHEMBL819272)
Ki 0.13±n/a nM
Citation Deadman, JJElgendy, SGoodwin, CAGreen, DBaban, JAPatel, GSkordalakes, EChino, NClaeson, GKakkar, VV Characterization of a class of peptide boronates with neutral P1 side chains as highly selective inhibitors of thrombin. J Med Chem38:1511-22 (1995) Prothrombin
Name:Prothrombin
Type:Protein
Mol. Mass.:70029.57
Organism:Homo sapiens (Human)
Description:P00734
Residue:622
BDBM50034580
NameBDBM50034580
Synonyms:CHEMBL418050 | Peptide boronate
TypeSmall organic molecule
Emp. Form.C46H52BN3O6
Mol. Mass.753.733
SMILESCC1(C)C2CC1[C@]1(C)OB(O[C@@H]1C2)C(Cc1ccccc1)NC(=O)[C@@H]1CCCN1C(=O)[C@@H](NC(=O)OCc1ccccc1)C(c1ccccc1)c1ccccc1