Reaction Details
TargetSerine protease 1
LigandBDBM50034583
Substrate/Competitorn/a
Meas. Tech.ChEMBL_212372 (CHEMBL817620)
Ki 0.45±n/a nM
Citation Deadman, JJElgendy, SGoodwin, CAGreen, DBaban, JAPatel, GSkordalakes, EChino, NClaeson, GKakkar, VV Characterization of a class of peptide boronates with neutral P1 side chains as highly selective inhibitors of thrombin. J Med Chem38:1511-22 (1995) Serine protease 1
Name:Serine protease 1
Type:Enzyme
Mol. Mass.:25790.52
Organism:Bos taurus (bovine)
Description:P00760
Residue:246
BDBM50034583
NameBDBM50034583
Synonyms:CHEMBL287918 | Peptide boronate
TypeSmall organic molecule
Emp. Form.C44H56BN3O6
Mol. Mass.733.743
SMILESCCCCCC(NC(=O)[C@@H]1CCCN1C(=O)[C@@H](NC(=O)OCc1ccccc1)C(c1ccccc1)c1ccccc1)B1O[C@@H]2CC3CC(C3(C)C)[C@]2(C)O1