Reaction Details
TargetNeutrophil elastase
LigandBDBM50034668
Substrate/Competitorn/a
Meas. Tech.ChEMBL_63982 (CHEMBL677608)
Ki 4.5±n/a nM
Citation Desai, RCCourt, JCFerguson, EGordon, RJHlasta, DJDunlap, RPFranke, CA Phosphonates and phosphinates: novel leaving groups for benzisothiazolone inhibitors of human leukocyte elastase. J Med Chem38:1571-4 (1995) Neutrophil elastase
Name:Neutrophil elastase
Type:Enzyme
Mol. Mass.:28532.38
Organism:Homo sapiens (Human)
Description:P08246
Residue:267
BDBM50034668
NameBDBM50034668
Synonyms:CHEMBL39165 | Phosphoric acid diethyl ester 6-hydroxy-4-isopropyl-1,1,3-trioxo-1,3-dihydro-1lambda*6*-benzo[d]isothiazol-2-ylmethyl ester
TypeSmall organic molecule
Emp. Form.C15H22NO8PS
Mol. Mass.407.376
SMILESCCOP(=O)(OCC)OCN1C(=O)c2c(cc(O)cc2C(C)C)S1(=O)=O