Reaction Details
TargetNeutrophil elastase
LigandBDBM50034676
Substrate/Competitorn/a
Meas. Tech.ChEMBL_63982 (CHEMBL677608)
Ki 0.07±n/a nM
Citation Desai, RCCourt, JCFerguson, EGordon, RJHlasta, DJDunlap, RPFranke, CA Phosphonates and phosphinates: novel leaving groups for benzisothiazolone inhibitors of human leukocyte elastase. J Med Chem38:1571-4 (1995) Neutrophil elastase
Name:Neutrophil elastase
Type:Enzyme
Mol. Mass.:28532.38
Organism:Homo sapiens (Human)
Description:P08246
Residue:267
BDBM50034676
NameBDBM50034676
Synonyms:CHEMBL41881 | Phosphoric acid 4-sec-butyl-1,1,3-trioxo-1,3-dihydro-1lambda*6*-benzo[d]isothiazol-2-ylmethyl ester diethyl ester
TypeSmall organic molecule
Emp. Form.C16H24NO7PS
Mol. Mass.405.403
SMILESCCOP(=O)(OCC)OCN1C(=O)c2c(cccc2C(C)CC)S1(=O)=O