Reaction Details
TargetIntegrin alpha-IIb/beta-3
LigandBDBM50034690
Substrate/Competitorn/a
Meas. Tech.ChEMBL_30111 (CHEMBL642038)
IC50 8±n/a nM
Citation Hoekstra, WJBeavers, MPAndrade-Gordon, PEvangelisto, MFKeane, PMPress, JBTomko, KAFan, FKloczewiak, MMayo, KH Design and evaluation of nonpeptide fibrinogen gamma-chain based GPIIb/IIIa antagonists. J Med Chem38:1582-92 (1995) Integrin alpha-IIb/beta-3
Name:Integrin alpha-IIb/beta-3
Synonyms:Glycoprotein IIb/IIIa
Type:n/a
Mol. Mass.:n/a
Description:ASSAY_ID of EBI is 30109
Components:This complex has 2 components.
Component 1
Name:Integrin beta-3
Type:Protein
Mol. Mass.:87038.91
Organism:Homo sapiens (Human)
Description:P05106
Residue:788
Component 2
Name:Integrin alpha-IIb
Synonyms:CD_antigen=CD41 GPIIb Glycoprotein IIb ITGA2B Integrin alpha-IIb heavy chain Integrin alpha-IIb light chain, form 2 Integrin alpha-V/beta-3 and alpha-IIb/beta 3 | Platelet membrane glycoprotein IIb
Type:Protein
Mol. Mass.:113354.85
Organism:Homo sapiens (Human)
Description:P08514
Residue:1039
BDBM50034690
NameBDBM50034690
Synonyms:3-{[(R)-1-((S)-6-Amino-2-tert-butoxycarbonylamino-hexanoyl)-piperidine-3-carbonyl]-amino}-propionic acid | CHEMBL416419
TypeSmall organic molecule
Emp. Form.C20H36N4O6
Mol. Mass.428.523
SMILESCC(C)(C)OC(=O)N[C@@H](CCCCN)C(=O)N1CCC[C@H](C1)C(=O)NCCC(O)=O