Reaction Details
TargetDihydrofolate reductase
LigandBDBM50029766
Substrate/Competitorn/a
Meas. Tech.ChEMBL_54967 (CHEMBL875140)
IC50 7.6±n/a nM
Citation Gangjee, AVasudevan, AQueener, SFKisliuk, RL 6-substituted 2,4-diamino-5-methylpyrido[2,3-d]pyrimidines as inhibitors of dihydrofolate reductases from Pneumocystis carinii and Toxoplasma gondii and as antitumor agents. J Med Chem38:1778-85 (1995) Dihydrofolate reductase
Name:Dihydrofolate reductase
Type:Enzyme
Mol. Mass.:21638.84
Organism:Rattus norvegicus (rat)
Description:n/a
Residue:187
BDBM50029766
NameBDBM50029766
Synonyms:2,4-DIAMINO-5-METHYL-6-[(3,4,5-TRIMETHOXY-N-METHYLANILINO)METHYL]PYRIDO[2,3-D]PYRIMIDINE CHEMBL50514
TypeSmall organic molecule
Emp. Form.C19H24N6O3
Mol. Mass.384.4323
SMILESCOc1cc(cc(OC)c1OC)N(C)Cc1cnc2nc(N)nc(N)c2c1C