Reaction Details
TargetTranscription factor 7-like 2
LigandBDBM50094597
Substrate/Competitorn/a
Meas. Tech.ChEMBL_938101 (CHEMBL2328061)
Ki 77000±n/a nM
Citation Zhang, MCatrow, JLJi, H High-Throughput Selectivity Assays for Small-Molecule Inhibitors of ?-Catenin/T-Cell Factor Protein-Protein Interactions. ACS Med Chem Lett4:306-11 (2013) 
 
Transcription factor 7-like 2
Name:Transcription factor 7-like 2
Type:PROTEIN
Mol. Mass.:67939.08
Organism:Homo sapiens (Human)
Description:ChEMBL_107937
Residue:619
BDBM50094597
NameBDBM50094597
Synonyms:CHEMBL2323028
TypeSmall organic molecule
Emp. Form.C16H10ClNO4
Mol. Mass.315.708
SMILESOC(=O)c1cc(on1)-c1ccc(Oc2ccc(Cl)cc2)cc1