Reaction Details
TargetTranscription factor 7-like 2
LigandBDBM50094600
Substrate/Competitorn/a
Meas. Tech.ChEMBL_938101 (CHEMBL2328061)
Ki 8800±n/a nM
Citation Zhang, MCatrow, JLJi, H High-Throughput Selectivity Assays for Small-Molecule Inhibitors of ?-Catenin/T-Cell Factor Protein-Protein Interactions. ACS Med Chem Lett4:306-11 (2013) 
 
Transcription factor 7-like 2
Name:Transcription factor 7-like 2
Type:PROTEIN
Mol. Mass.:67939.08
Organism:Homo sapiens (Human)
Description:ChEMBL_107937
Residue:619
BDBM50094600
NameBDBM50094600
Synonyms:CHEMBL2323029
TypeSmall organic molecule
Emp. Form.C21H12Cl2N2O2
Mol. Mass.395.238
SMILESOC(=O)c1ccc2nc(-c3ccc(Cl)cc3)c(nc2c1)-c1ccc(Cl)cc1