Reaction Details
TargetTranscription factor 7-like 2
LigandBDBM32102
Substrate/Competitorn/a
Meas. Tech.ChEMBL_938104 (CHEMBL2328064)
Ki 3700±n/a nM
Citation Zhang, MCatrow, JLJi, H High-Throughput Selectivity Assays for Small-Molecule Inhibitors of ?-Catenin/T-Cell Factor Protein-Protein Interactions. ACS Med Chem Lett4:306-11 (2013) 
 
Transcription factor 7-like 2
Name:Transcription factor 7-like 2
Type:PROTEIN
Mol. Mass.:67939.08
Organism:Homo sapiens (Human)
Description:ChEMBL_107937
Residue:619
BDBM32102
NameBDBM32102
Synonyms:1,6-dimethylpyrimido[5,4-e][1,2,4]triazine-5,7(1H,6H)-dione 1,6-dimethylpyrimido[5,4-e][1,2,4]triazine-5,7-quinone SMR000024051 US9738628, Compound PKF118-310 | cid_66541
TypeSmall organic molecule
Emp. Form.C7H7N5O2
Mol. Mass.193.1628
SMILESCn1ncnc2c1nc(=O)n(C)c2=O