Reaction Details
TargetTranscription factor 7-like 2
LigandBDBM50014132
Substrate/Competitorn/a
Meas. Tech.ChEMBL_938104 (CHEMBL2328064)
Ki 3800±n/a nM
Citation Zhang, MCatrow, JLJi, H High-Throughput Selectivity Assays for Small-Molecule Inhibitors of ?-Catenin/T-Cell Factor Protein-Protein Interactions. ACS Med Chem Lett4:306-11 (2013) 
 
Transcription factor 7-like 2
Name:Transcription factor 7-like 2
Type:PROTEIN
Mol. Mass.:67939.08
Organism:Homo sapiens (Human)
Description:ChEMBL_107937
Residue:619
BDBM50014132
NameBDBM50014132
Synonyms:CHEMBL2323032
TypeSmall organic molecule
Emp. Form.C10H10N6O
Mol. Mass.230.226
SMILESOn1ncc2cc(CCc3nn[nH]n3)ccc12