Reaction Details
TargetTranscription factor 7-like 2
LigandBDBM50489463
Substrate/Competitorn/a
Meas. Tech.ChEMBL_938104 (CHEMBL2328064)
Ki 21000±n/a nM
Citation Zhang, MCatrow, JLJi, H High-Throughput Selectivity Assays for Small-Molecule Inhibitors of ?-Catenin/T-Cell Factor Protein-Protein Interactions. ACS Med Chem Lett4:306-11 (2013) 
 
Transcription factor 7-like 2
Name:Transcription factor 7-like 2
Type:PROTEIN
Mol. Mass.:67939.08
Organism:Homo sapiens (Human)
Description:ChEMBL_107937
Residue:619
BDBM50489463
NameBDBM50489463
Synonyms:CHEMBL2323031
TypeSmall organic molecule
Emp. Form.C20H16N4O5
Mol. Mass.392.3648
SMILESOC(=O)c1cccc(NC(=O)C(=O)N\N=C2/C(=O)N(CC=C)c3ccccc23)c1