Reaction Details
TargetTranscription factor 7-like 2
LigandBDBM50094484
Substrate/Competitorn/a
Meas. Tech.ChEMBL_938101 (CHEMBL2328061)
Ki 36000±n/a nM
Citation Zhang, MCatrow, JLJi, H High-Throughput Selectivity Assays for Small-Molecule Inhibitors of ?-Catenin/T-Cell Factor Protein-Protein Interactions. ACS Med Chem Lett4:306-11 (2013) 
 
Transcription factor 7-like 2
Name:Transcription factor 7-like 2
Type:PROTEIN
Mol. Mass.:67939.08
Organism:Homo sapiens (Human)
Description:ChEMBL_107937
Residue:619
BDBM50094484
NameBDBM50094484
Synonyms:CHEBI:3556 US9284299, CGP049090 | US9738628, Compound CGP049090
TypeSmall organic molecule
Emp. Form.C29H26O10
Mol. Mass.534.5107
SMILESCOc1c(C[C@H](C)O)c2c3c(C[C@H](C)O)c(OC)c(=O)c4c(O)cc5OCOc6cc(O)c(c2c6c5c34)c1=O