Reaction Details
TargetTranscription factor 7-like 2
LigandBDBM50249236
Substrate/Competitorn/a
Meas. Tech.ChEMBL_938101 (CHEMBL2328061)
Ki 18000±n/a nM
Citation Zhang, MCatrow, JLJi, H High-Throughput Selectivity Assays for Small-Molecule Inhibitors of ?-Catenin/T-Cell Factor Protein-Protein Interactions. ACS Med Chem Lett4:306-11 (2013) 
 
Transcription factor 7-like 2
Name:Transcription factor 7-like 2
Type:PROTEIN
Mol. Mass.:67939.08
Organism:Homo sapiens (Human)
Description:ChEMBL_107937
Residue:619
BDBM50249236
NameBDBM50249236
Synonyms:(R)-1-(4,9-dihydroxy-12-((R)-2-((4-hydroxyphenoxy)carbonyloxy)propyl)-2,6,7,11-tetramethoxy-3,10-dioxo-3,10-dihydroperylen-1-yl)propan-2-yl benzoate | CHEMBL460433
TypeSmall organic molecule
Emp. Form.C44H38O14
Mol. Mass.790.7641
SMILESCOc1cc(=O)c2c(O)c(OC)c(C[C@@H](C)OC(=O)Oc3ccc(O)cc3)c3c4c(C[C@@H](C)OC(=O)c5ccccc5)c(OC)c(O)c5c4c(c(OC)cc5=O)c1c23