Reaction Details
TargetDNA primase
LigandBDBM50034949
Substrate/Competitorn/a
Meas. Tech.ChEMBL_81580 (CHEMBL689340)
IC50 770.0±n/a nM
Citation Crute, JJLehman, IRGambino, JYang, TFMedveczky, PMedveczky, MKhan, NNMulder, CMonroe, JWright, GE Inhibition of herpes simplex virus type 1 helicase-primase by (dichloroanilino)purines and -pyrimidines. J Med Chem38:1820-5 (1995) DNA primase
Name:DNA primase
Type:PROTEIN
Mol. Mass.:114429.27
Organism:Human herpesvirus 1 (strain 17) (HHV-1) (Human herpes simplex virus1)
Description:ChEMBL_84513
Residue:1058
BDBM50034949
NameBDBM50034949
Synonyms:2-Amino-6-(3,5-dichloro-phenylamino)-3H-pyrimidin-4-one | CHEMBL301283
TypeSmall organic molecule
Emp. Form.C10H8Cl2N4O
Mol. Mass.271.103
SMILESNc1nc(Nc2cc(Cl)cc(Cl)c2)cc(=O)[nH]1