Reaction Details
TargetDNA primase
LigandBDBM50034955
Substrate/Competitorn/a
Meas. Tech.ChEMBL_81442 (CHEMBL690907)
IC50 13000±n/a nM
Citation Crute, JJLehman, IRGambino, JYang, TFMedveczky, PMedveczky, MKhan, NNMulder, CMonroe, JWright, GE Inhibition of herpes simplex virus type 1 helicase-primase by (dichloroanilino)purines and -pyrimidines. J Med Chem38:1820-5 (1995) DNA primase
Name:DNA primase
Type:PROTEIN
Mol. Mass.:114429.27
Organism:Human herpesvirus 1 (strain 17) (HHV-1) (Human herpes simplex virus1)
Description:ChEMBL_84513
Residue:1058
BDBM50034955
NameBDBM50034955
Synonyms:CHEMBL53605 | N*2*-(3,4-Dichloro-phenyl)-9H-purine-2,6-diamine
TypeSmall organic molecule
Emp. Form.C11H8Cl2N6
Mol. Mass.295.127
SMILESNc1nc(Nc2ccc(Cl)c(Cl)c2)nc2nc[nH]c12