Reaction Details
TargetDNA primase
LigandBDBM50028342
Substrate/Competitorn/a
Meas. Tech.ChEMBL_81580 (CHEMBL689340)
IC50>2000±n/a nM
Citation Crute, JJLehman, IRGambino, JYang, TFMedveczky, PMedveczky, MKhan, NNMulder, CMonroe, JWright, GE Inhibition of herpes simplex virus type 1 helicase-primase by (dichloroanilino)purines and -pyrimidines. J Med Chem38:1820-5 (1995) DNA primase
Name:DNA primase
Type:PROTEIN
Mol. Mass.:114429.27
Organism:Human herpesvirus 1 (strain 17) (HHV-1) (Human herpes simplex virus1)
Description:ChEMBL_84513
Residue:1058
BDBM50028342
NameBDBM50028342
Synonyms:6-(3,4-Dichloro-phenylamino)-1H-pyrimidine-2,4-dione | CHEMBL52034
TypeSmall organic molecule
Emp. Form.C10H7Cl2N3O2
Mol. Mass.272.087
SMILESClc1ccc(Nc2cc(=O)[nH]c(=O)[nH]2)cc1Cl