Reaction Details
TargetSodium channel protein type 9 subunit alpha
LigandBDBM50257178
Substrate/Competitorn/a
Meas. Tech.ChEMBL_938986 (CHEMBL2328568)
IC50 3.1±n/a nM
Citation Norinder, UEk, ME QSAR investigation of NaV1.7 active compounds using the SVM/Signature approach and the Bioclipse Modeling platform. Bioorg Med Chem Lett23:261-3 (2013) 
 
Sodium channel protein type 9 subunit alpha
Name:Sodium channel protein type 9 subunit alpha
Type:Protein
Mol. Mass.:226375.97
Organism:Homo sapiens (Human)
Description:Q15858
Residue:1988
BDBM50257178
NameBDBM50257178
Synonyms:CHEMBL2325627
TypeSmall organic molecule
Emp. Form.C18H11ClF4N6O3S2
Mol. Mass.534.895
SMILESNc1n[nH]cc1-c1cc(ccc1Oc1cc(F)c(cc1Cl)S(=O)(=O)Nc1nncs1)C(F)(F)F