Reaction Details
TargetAromatase
LigandBDBM9460
Substrate/Competitorn/a
Meas. Tech.ChEMBL_51215 (CHEMBL664334)
IC50 6200±n/a nM
Citation Hartmann, RWBayer, HGrün, GSergejew, TBartz, UMitrenga, M Pyridyl-substituted tetrahydrocyclopropa[a]naphthalenes: highly active and selective inhibitors of P450 arom. J Med Chem38:2103-11 (1995) Aromatase
Name:Aromatase
Type:PROTEIN
Mol. Mass.:58418.09
Organism:Rattus norvegicus
Description:ChEMBL_51211
Residue:508
BDBM9460
NameBDBM9460
Synonyms:3-(4-aminophenyl)-3-ethyl-piperidine-2,6-dione Aminoglutethimide AG, 4 Cytadren Elipten | aminoglutethimide (AG)
TypeSmall organic molecule
Emp. Form.C13H16N2O2
Mol. Mass.232.2783
SMILESCCC1(CCC(=O)NC1=O)c1ccc(N)cc1