Reaction Details
TargetMuscarinic acetylcholine receptor M1
LigandBDBM50018229
Substrate/Competitorn/a
Meas. Tech.ChEMBL_956590 (CHEMBL2380040)
Ki 44±n/a nM
Citation Bhattacharjee, AKPomponio, JWEvans, SAPervitsky, DGordon, RK Discovery of subtype selective muscarinic receptor antagonists as alternatives to atropine using in silico pharmacophore modeling and virtual screening methods. Bioorg Med Chem21:2651-62 (2013) 
 
Muscarinic acetylcholine receptor M1
Name:Muscarinic acetylcholine receptor M1
Type:Protein
Mol. Mass.:51442.54
Organism:Homo sapiens (Human)
Description:P11229
Residue:460
BDBM50018229
NameBDBM50018229
Synonyms:2-(4-Hydroxy-phenyl)-2-phenyl-propionic acid 2-diethylamino-ethyl ester | CHEMBL37372
TypeSmall organic molecule
Emp. Form.C21H27NO3
Mol. Mass.341.444
SMILESCCN(CC)CCOC(=O)C(C)(c1ccccc1)c1ccc(O)cc1