Reaction Details
TargetProstaglandin G/H synthase 2
LigandBDBM50035690
Substrate/Competitorn/a
Meas. Tech.ChEMBL_956924 (CHEMBL2378241)
IC50>100000±n/a nM
Citation Al-Suwaidan, IAAlanazi, AMEl-Azab, ASAl-Obaid, AMElTahir, KEMaarouf, ARAbu El-Enin, MAAbdel-Aziz, AA Molecular design, synthesis and biological evaluation of cyclic imides bearing benzenesulfonamide fragment as potential COX-2 inhibitors. Part 2. Bioorg Med Chem Lett23:2601-5 (2013) 
 
Prostaglandin G/H synthase 2
Name:Prostaglandin G/H synthase 2
Type:Protein
Mol. Mass.:68976.98
Organism:Ovis aries (Sheep)
Description:n/a
Residue:603
BDBM50035690
NameBDBM50035690
Synonyms:CHEMBL2377789
TypeSmall organic molecule
Emp. Form.C16H11NO4
Mol. Mass.281.2628
SMILESCc1ccc2C(=O)N(C(=O)c2c1)c1ccc(cc1)C(O)=O