Reaction Details
TargetNeutrophil elastase
LigandBDBM50035948
Substrate/Competitorn/a
Meas. Tech.ChEMBL_63981 (CHEMBL677607)
Ki 0.7±n/a nM
Citation Bernstein, PRGomes, BCKosmider, BJVacek, EPWilliams, JC Nonpeptidic inhibitors of human leukocyte elastase. 6. Design of a potent, intratracheally active, pyridone-based trifluoromethyl ketone. J Med Chem38:212-5 (1995) Neutrophil elastase
Name:Neutrophil elastase
Type:Enzyme
Mol. Mass.:28532.38
Organism:Homo sapiens (Human)
Description:P08246
Residue:267
BDBM50035948
NameBDBM50035948
Synonyms:2-[3-(4-Acetylamino-benzenesulfonylamino)-2-oxo-6-phenyl-2H-pyridin-1-yl]-N-(3,3,3-trifluoro-1-isopropyl-2-oxo-propyl)-acetamide | CHEMBL307315
TypeSmall organic molecule
Emp. Form.C27H27F3N4O6S
Mol. Mass.592.587
SMILESCC(C)C(NC(=O)Cn1c(ccc(NS(=O)(=O)c2ccc(NC(C)=O)cc2)c1=O)-c1ccccc1)C(=O)C(F)(F)F