Reaction Details
TargetNeutrophil elastase
LigandBDBM50036058
Substrate/Competitorn/a
Meas. Tech.ChEMBL_63986 (CHEMBL677612)
Ki 1.6±n/a nM
Citation Edwards, PDWolanin, DJAndisik, DWDavis, MW Peptidyl alpha-ketoheterocyclic inhibitors of human neutrophil elastase. 2. Effect of varying the heterocyclic ring on in vitro potency. J Med Chem38:76-85 (1995) Neutrophil elastase
Name:Neutrophil elastase
Type:Enzyme
Mol. Mass.:28532.38
Organism:Homo sapiens (Human)
Description:P08246
Residue:267
BDBM50036058
NameBDBM50036058
Synonyms:CHEMBL354883 {(S)-2-Methyl-1-[(S)-2-((S)-3,3,3-trifluoro-1-isopropyl-2-oxo-propylcarbamoyl)-pyrrolidine-1-carbonyl]-propyl}-carbamic acid benzyl ester
TypeSmall organic molecule
Emp. Form.C24H32F3N3O5
Mol. Mass.499.5232
SMILESCC(C)[C@H](NC(=O)OCc1ccccc1)C(=O)N1CCC[C@H]1C(=O)N[C@@H](C(C)C)C(=O)C(F)(F)F