Reaction Details
TargetNeutrophil elastase
LigandBDBM50036061
Substrate/Competitorn/a
Meas. Tech.ChEMBL_63984 (CHEMBL677610)
Ki 1000±n/a nM
Citation Veale, CADamewood, JRSteelman, GBBryant, CGomes, BWilliams, J Non-peptidic inhibitors of human leukocyte elastase. 4. Design, synthesis, and in vitro and in vivo activity of a series of beta-carbolinone-containing trifluoromethyl ketones. J Med Chem38:86-97 (1995) Neutrophil elastase
Name:Neutrophil elastase
Type:Enzyme
Mol. Mass.:28532.38
Organism:Homo sapiens (Human)
Description:P08246
Residue:267
BDBM50036061
NameBDBM50036061
Synonyms:2-(6-Chloro-1-oxo-1,3,4,9-tetrahydro-beta-carbolin-2-yl)-N-(3,3,3-trifluoro-1-isopropyl-2-oxo-propyl)-acetamide | CHEMBL176985
TypeSmall organic molecule
Emp. Form.C19H19ClF3N3O3
Mol. Mass.429.821
SMILESCC(C)C(NC(=O)CN1CCc2c([nH]c3ccc(Cl)cc23)C1=O)C(=O)C(F)(F)F