Reaction Details
TargetNeutrophil elastase
LigandBDBM50036065
Substrate/Competitorn/a
Meas. Tech.ChEMBL_63984 (CHEMBL677610)
Ki 4.9±n/a nM
Citation Veale, CADamewood, JRSteelman, GBBryant, CGomes, BWilliams, J Non-peptidic inhibitors of human leukocyte elastase. 4. Design, synthesis, and in vitro and in vivo activity of a series of beta-carbolinone-containing trifluoromethyl ketones. J Med Chem38:86-97 (1995) Neutrophil elastase
Name:Neutrophil elastase
Type:Enzyme
Mol. Mass.:28532.38
Organism:Homo sapiens (Human)
Description:P08246
Residue:267
BDBM50036065
NameBDBM50036065
Synonyms:2-(8-Formyl-1-oxo-3-phenyl-1,9-dihydro-beta-carbolin-2-yl)-N-(3,3,3-trifluoro-1-isopropyl-2-oxo-propyl)-acetamide | CHEMBL424770
TypeSmall organic molecule
Emp. Form.C26H22F3N3O4
Mol. Mass.497.4658
SMILESCC(C)C(NC(=O)Cn1c(O)c2nc3c(C=O)cccc3c2cc1-c1ccccc1)C(=O)C(F)(F)F