Reaction Details
TargetNeutrophil elastase
LigandBDBM50036074
Substrate/Competitorn/a
Meas. Tech.ChEMBL_63984 (CHEMBL677610)
Ki 290±n/a nM
Citation Veale, CADamewood, JRSteelman, GBBryant, CGomes, BWilliams, J Non-peptidic inhibitors of human leukocyte elastase. 4. Design, synthesis, and in vitro and in vivo activity of a series of beta-carbolinone-containing trifluoromethyl ketones. J Med Chem38:86-97 (1995) Neutrophil elastase
Name:Neutrophil elastase
Type:Enzyme
Mol. Mass.:28532.38
Organism:Homo sapiens (Human)
Description:P08246
Residue:267
BDBM50036074
NameBDBM50036074
Synonyms:2-(1-Oxo-1,9-dihydro-beta-carbolin-2-yl)-N-(3,3,3-trifluoro-1-isopropyl-2-oxo-propyl)-acetamide | CHEMBL367631
TypeSmall organic molecule
Emp. Form.C19H18F3N3O3
Mol. Mass.393.3597
SMILESCC(C)C(NC(=O)Cn1ccc2c(nc3ccccc23)c1O)C(=O)C(F)(F)F