Reaction Details
TargetCathepsin G
LigandBDBM50036060
Substrate/Competitorn/a
Meas. Tech.ChEMBL_45363 (CHEMBL661899)
Ki 130000±n/a nM
Citation Veale, CADamewood, JRSteelman, GBBryant, CGomes, BWilliams, J Non-peptidic inhibitors of human leukocyte elastase. 4. Design, synthesis, and in vitro and in vivo activity of a series of beta-carbolinone-containing trifluoromethyl ketones. J Med Chem38:86-97 (1995) Cathepsin G
Name:Cathepsin G
Type:PROTEIN
Mol. Mass.:28860.08
Organism:Homo sapiens (Human)
Description:ChEMBL_1469016
Residue:255
BDBM50036060
NameBDBM50036060
Synonyms:1-Oxo-2-[(3,3,3-trifluoro-1-isopropyl-2-oxo-propylcarbamoyl)-methyl]-2,9-dihydro-1H-beta-carboline-8-carboxylic acid | CHEMBL174215
TypeSmall organic molecule
Emp. Form.C20H18F3N3O5
Mol. Mass.437.3692
SMILESCC(C)C(NC(=O)Cn1ccc2c(nc3c(cccc23)C(O)=O)c1O)C(=O)C(F)(F)F