Reaction Details
TargetDNA topoisomerase 1
LigandBDBM50036133
Substrate/Competitorn/a
Meas. Tech.ChEMBL_53717 (CHEMBL663645)
IC50 78±n/a nM
Citation Luzzio, MJBesterman, JMEmerson, DLEvans, MGLackey, KLeitner, PLMcIntyre, GMorton, BMyers, PLPeel, M Synthesis and antitumor activity of novel water soluble derivatives of camptothecin as specific inhibitors of topoisomerase I. J Med Chem38:395-401 (1995) DNA topoisomerase 1
Name:DNA topoisomerase 1
Type:Enzyme
Mol. Mass.:90771.02
Organism:Homo sapiens (Human)
Description:P11387
Residue:765
BDBM50036133
NameBDBM50036133
Synonyms:7-ethyl-7-hydroxy-(7S)-7,8,11,13-tetrahydro-10H-[1,3]dioxolo[4,5-g]pyrano[3',4':6,7]indolizino[1,2-b]quinoline-8,11-dione CHEMBL307794
TypeSmall organic molecule
Emp. Form.C21H16N2O6
Mol. Mass.392.3615
SMILESCC[C@@]1(O)C(=O)OCc2c1cc1-c3nc4cc5OCOc5cc4cc3Cn1c2=O