Reaction Details
TargetSigma non-opioid intracellular receptor 1
LigandBDBM50036234
Substrate/Competitorn/a
Meas. Tech.ChEMBL_202041 (CHEMBL809514)
Ki 1.45±n/a nM
Citation Mascarella, SWBai, XWilliams, WSine, BBowen, WDCarroll, FI (+)-cis-N-(para-, meta-, and ortho-substituted benzyl)-N-normetazocines: synthesis and binding affinity at the [3H]-(+)-pentazocine-labeled (sigma 1) site and quantitative structure-affinity relationship studies. J Med Chem38:565-9 (1995) Sigma non-opioid intracellular receptor 1
Name:Sigma non-opioid intracellular receptor 1
Type:Enzyme Catalytic Domain
Mol. Mass.:25124.85
Organism:Homo sapiens (Human)
Description:Q99720
Residue:223
BDBM50036234
NameBDBM50036234
Synonyms:(2S,6S,11S)-3-(2-Fluoro-benzyl)-6,11-dimethyl-1,2,3,4,5,6-hexahydro-2,6-methano-benzo[d]azocin-8-ol | CHEMBL154039
TypeSmall organic molecule
Emp. Form.C21H24FNO
Mol. Mass.325.4198
SMILESC[C@@H]1[C@@H]2Cc3ccc(O)cc3[C@@]1(C)CCN2Cc1ccccc1F