Reaction Details
TargetSigma non-opioid intracellular receptor 1
LigandBDBM50036238
Substrate/Competitorn/a
Meas. Tech.ChEMBL_202041 (CHEMBL809514)
Ki 1.53±n/a nM
Citation Mascarella, SWBai, XWilliams, WSine, BBowen, WDCarroll, FI (+)-cis-N-(para-, meta-, and ortho-substituted benzyl)-N-normetazocines: synthesis and binding affinity at the [3H]-(+)-pentazocine-labeled (sigma 1) site and quantitative structure-affinity relationship studies. J Med Chem38:565-9 (1995) Sigma non-opioid intracellular receptor 1
Name:Sigma non-opioid intracellular receptor 1
Type:Enzyme Catalytic Domain
Mol. Mass.:25124.85
Organism:Homo sapiens (Human)
Description:Q99720
Residue:223
BDBM50036238
NameBDBM50036238
Synonyms:4-((2S,6S,11S)-8-Hydroxy-6,11-dimethyl-1,2,5,6-tetrahydro-4H-2,6-methano-benzo[d]azocin-3-ylmethyl)-benzonitrile | CHEMBL153341
TypeSmall organic molecule
Emp. Form.C22H24N2O
Mol. Mass.332.4388
SMILESC[C@@H]1[C@@H]2Cc3ccc(O)cc3[C@@]1(C)CCN2Cc1ccc(cc1)C#N