Reaction Details
TargetNeutrophil elastase
LigandBDBM50036481
Substrate/Competitorn/a
Meas. Tech.ChEMBL_64003 (CHEMBL673112)
Ki 0.013±n/a nM
Citation Hlasta, DJSubramanyam, CBell, MRCarabateas, PMCourt, JJDesai, RCDrozd, MLEickhoff, WMFerguson, EWGordon, RJ Orally bioavailable benzisothiazolone inhibitors of human leukocyte elastase. J Med Chem38:739-44 (1995) Neutrophil elastase
Name:Neutrophil elastase
Type:Enzyme
Mol. Mass.:28532.38
Organism:Homo sapiens (Human)
Description:P08246
Residue:267
BDBM50036481
NameBDBM50036481
Synonyms:2,6-Dichloro-3-[(2-dimethylamino-ethyl)-methyl-sulfamoyl]-benzoic acid 4-isopropyl-6-methoxy-1,1,3-trioxo-1,3-dihydro-1lambda*6*-benzo[d]isothiazol-2-ylmethyl ester | CHEMBL164352
TypeSmall organic molecule
Emp. Form.C24H29Cl2N3O8S2
Mol. Mass.622.538
SMILESCOc1cc2c(C(=O)N(COC(=O)c3c(Cl)ccc(c3Cl)S(=O)(=O)N(C)CCN(C)C)S2(=O)=O)c(c1)C(C)C