Reaction Details
TargetNeutrophil elastase
LigandBDBM50036482
Substrate/Competitorn/a
Meas. Tech.ChEMBL_64003 (CHEMBL673112)
Ki 0.2±n/a nM
Citation Hlasta, DJSubramanyam, CBell, MRCarabateas, PMCourt, JJDesai, RCDrozd, MLEickhoff, WMFerguson, EWGordon, RJ Orally bioavailable benzisothiazolone inhibitors of human leukocyte elastase. J Med Chem38:739-44 (1995) Neutrophil elastase
Name:Neutrophil elastase
Type:Enzyme
Mol. Mass.:28532.38
Organism:Homo sapiens (Human)
Description:P08246
Residue:267
BDBM50036482
NameBDBM50036482
Synonyms:2,6-Dichloro-3-(4-methyl-piperazine-1-sulfonyl)-benzoic acid 6-hydroxy-4-isopropyl-1,1,3-trioxo-1,3-dihydro-1lambda*6*-benzo[d]isothiazol-2-ylmethyl ester | CHEMBL162863
TypeSmall organic molecule
Emp. Form.C23H25Cl2N3O8S2
Mol. Mass.606.496
SMILESCC(C)c1cc(O)cc2c1C(=O)N(COC(=O)c1c(Cl)ccc(c1Cl)S(=O)(=O)N1CCN(C)CC1)S2(=O)=O