Reaction Details
TargetMu-type opioid receptor
LigandBDBM50453625
Substrate/Competitorn/a
Meas. Tech.ChEMBL_138879 (CHEMBL747871)
IC50 0.100000±n/a nM
Citation Pitzele, BSHamilton, RWKudla, KDTsymbalov, SStapelfeld, ASavage, MAClare, MHammond, DLHansen, DW Enkephalin analogs as systemically active antinociceptive agents: O- and N-alkylated derivatives of the dipeptide amide L-2,6-dimethyltyrosyl-N-(3-phenylpropyl)-D-alaninamide. J Med Chem37:888-96 (1994) Mu-type opioid receptor
Name:Mu-type opioid receptor
Type:G Protein-Coupled Receptor (GPCR)
Mol. Mass.:44503.11
Organism:Rattus norvegicus (rat)
Description:Competition binding assays were carried out using membrane preparations from transfected HN9.10 cells that constitutively expressed the mu opioid receptor.
Residue:398
BDBM50453625
NameBDBM50453625
Synonyms:CHEMBL2110229
TypeSmall organic molecule
Emp. Form.C24H33N3O3
Mol. Mass.411.5371
SMILESC[C@@H](N(C)C(=O)[C@@H](N)Cc1c(C)cc(O)cc1C)C(=O)NCCCc1ccccc1